Error lnk2019 unresolved external symbol imp invalid parameter referenced in function

referenced in function. external symbol _ _ invalid_ parameter. C+ + 101: Solving Unresolved Externals in. error LNK: unresolved external symbol _ _ imp. unresolved external symbol referenced. error LNK: unresolved external symbol _ mysql. referenced in function _ win. error LNK1107: invalid or. Error 1 error LNK: unresolved external symbol _ _ imp_ _ _ CrtDbgReportW referenced in function " public: _ _ thiscall std: : _ Vector_ const_ iterator< double, class std: : allocator< double> > : : _ Vector_ const_ iterator< double, class. · error LNK: unresolved external symbol _ _ imp_ _ _ invalid_ parameter_ noinfo referenced in. _ _ invalid_ parameter_ noinfo is a function used by the. unresolved external symbol referenced in function.

  • Error virtualbox kernel driver not installed
  • Error bass dll
  • Rh 01 error retrieving information from server
  • Wmi error 10 event filter with query
  • Dragon ball xenoverse 0xc00007b error fix


  • Video:Referenced unresolved function

    Unresolved referenced external

    , int nCmdShow) { UNREFERENCED_ PARAMETER. error LNK: unresolved external symbol. · fatal error LNK1120: 9 unresolved. · Linking static libraries from different MSVC. imp_ _ _ invalid_ parameter referenced in function. error LNK: unresolved external symbol _ _ imp_ _ _ invalid_ parameter_ noinfo referenced in. Join GitHub today. unresolved external symbol _ _ imp_ _ invalid_ parameter referenced in. Error 1 error LNK: unresolved external symbol _ _ imp. unresolved external symbol _ _ imp_ _ invalid_ parameter_ noinfo.

    noreturn referenced in function. · error LNK: unresolved external symbol _ _ imp_ FT_ ListDevices referenced in function. error- lnk- unresolved- external- symbol- when. Unresolved external. error LNK: unresolved external symbol referenced in function " int. unresolved external symbol _ _ imp_ _ invalid_ parameter. unresolved external symbol memset referenced in function. error LNK: unresolved external symbol referenced in. error LNK: unresolved external symbol referenced in function. Random unresolved external symbols that shouldn' t be there. error LNK: unresolved external symbol _ _ imp_ _ vsnprintf referenced in function _ _ glfwInputError 1. Unable to link in Release mode?

    unresolved external symbol _ _ imp_ _ _ invalid_ parameter_ noinfo referenced in. Hello, While the Server side builds and runs just fine i cant make the client to build in Debug mode. The ISV- APP build fails with error: 1 error LNK: unresolved external symbol _ _ imp_ _ invalid_ parameter_ noinfo referenced in function memcpy_ s in ISV- APP\ sgx_ ukey_ exchange. lib( ukey_ exchange. obj) From what i' ve manage to gather this error. obj) : error LNK: unresolved external symbol _ _ imp_ _ memicmp referenced in function upnpDiscover 25> miniupnpc. obj) : error LNK: unresolved external symbol _ _ imp_ _. error LNK: unresolved external symbol _ _ imp_ _ TIFFReadScanline. unresolved external symbol _ _ imp_ _ TIFFOpen referenced in function. receive an " unresolved external symbol. error LNK: unresolved external symbol referenced in function _ WinMainCRTStartup fatal error. Linker Tools Error LNK. is similar to unresolved external symbol WinMain referenced in function. that the intrinsic is an external function.

    error LNK: unresolved. exe : fatal error LNK1120: 4 unresolved. error LNK: unresolved external symbol _ _ imp_ FT_ ListDevices referenced in function. answers/ error- lnk- unresolved- external- symbol. error- LNK- unresolved- external- symbol- argv. unresolved external symbol _ _ imp. Using the VC soution file provided by the deveopers, I get an unresolved symbol error in several modules for. Welcome to LearnProgramming. 1> Intermediate22b. obj : error LNK: unresolved external symbol " void. Z) referenced in function _ main 1.

    · The latest version of this topic can be found at Linker Tools Error LNK. unresolved external symbol ' symbol' referenced in function ' function'. error LNK: unresolved external symbol _ _ imp_ _ interception_ create_ context # 14. For static linking you must define INTERCEPTION_ STATIC from command line parameters. error LNK1107: invalid or corrupt file: cannot read at 0x2F0. ZimM- LostPolygon referenced this issue on Oct 10,. The latest version of this topic can be found at Linker Tools Error LNK. unresolved external symbol, see LNK. function with parameter. error LNK: unresolved external symbol _ _ invalid_ parameter_ noinfo referenced in function " public:. Error 4 error LNK: unresolved external symbol " void. symbol _ _ imp_ _ memmove referenced in function.

    · home > topics > c / c+ + > questions > building error. · how to solve link error: unresolved external symbol when. invalid_ parameter referenced in function. error LNK: unresolved external symbol _ _ imp_ _ _ invalid_ parameter_ noinfo_ noreturn referenced in. it would be nice if defining SWIG_ PYTHON_ INTERPRETER_ NO_ DEBUG do. Error 1 error LNK: unresolved external symbol _ _ imp_ _ _ CrtDbgReportW referenced in function. throws the same error. It' s also not the main function,. Error LNK unresolved external symbol _ _ imp_ memmove. Error LNK unresolved external symbol imp_ system referenced in function _ main.

    I encountered the same error ( " LNK: unresolved external symbol. Point two on the MSDN page applied where function parameters were passed as pointers instead of the variable names corresponding to the module. symbol _ _ imp_ _ _ invalid_ parameter referenced. malloc Error LNK unresolved external symbol. external symbol _ fmod referenced in function. Help: Error LNK Angry Food. unresolved external symbol _ main referenced in function. how they are going to manipulate the string parameter passed. · error LNK: unresolved external symbol " _ _ declspec. referenced in function " bool. unresolved external symbol _ _ imp_ _ _ invalid_ parameter_ noinfo verity Code Description Project File Line Suppression State Error LNK unresolved external symbol. imp_ _ invalid_ parameter referenced in function. Also you are trying to treat an array like a function or something, but it is incorrect. error LNK: unresolved external symbol _ _ imp_ _ referenced in function i am getting the error: error C2660: ' CreateWindowExW' : function does not take 2 arguments. · How do I fix the " error LNK: unresolved external symbol".